{"text_format":"1","workbook":"xlsx","n_sheets":3,"sheets":["transactions","WMI","year"],"not_rendered":{"charts":0,"images":0,"macros":1,"external_links":0,"defined_names":0,"comments":0,"pivot_tables":0},"unopened":[],"bounds":{"document_bytes":16777216,"sheet_cells":100000,"rows_first":2000,"rows_last":500,"rows_between":2000,"halvings":0,"cell_chars":16384,"cell_head_chars":4096},"cells_cut":0,"cells_raw":0,"read":"whole","date_system":"1900"}

{"sheet":"transactions","index":0,"n_rows":279,"n_cols":26,"rows_kept":279,"cut":false,"hidden":false,"merged":[]}
["id","full_name","first_name","last_name","phone","phone_2","address","street_address","city","state","postal","full_postal","email","email_2","gender","make","model","vin","card_no","card_Type","amount","WMI","year_digit","car_Manuf_country","car_mfr","model_year"]
[48,"Brannon, Chilton",null,null," 520-206-6847",null,"427 Crownhardt Trail, Huntsville, Alabama 35810",null,null,null,null,null,"  cbrannon1b@ezinearticles.com",null,"Male","Plymouth","Grand Voyager","WAURVAFA6AN134737",201837065985956,"diners-club-enroute",8873.94,null,null,{"$f":"IF(V2=\"\",\"\",VLOOKUP(V2,WMI!A:C,2,FALSE))","v":""},{"$f":"IF(V2=\"\",\"\",VLOOKUP(V2,WMI!A:C,3,FALSE))","v":""},{"$f":"IF(W2=\"\",\"\",VLOOKUP(W2,year!A:B,2,FALSE))","v":""}]
[91,"Favill, Enrika",null,null," 202-543-6964",null,"7454 Gale Center, Hamilton, Ohio 45020",null,null,null,null,null,"  efavill2i@cargocollective.com",null,"Female","Pontiac","Sunbird","WAUFFAFL2AN671008",3583504684725100,"jcb",7075.47,null,null,{"$f":"IF(V3=\"\",\"\",VLOOKUP(V3,WMI!A:C,2,FALSE))","v":""},{"$f":"IF(V3=\"\",\"\",VLOOKUP(V3,WMI!A:C,3,FALSE))","v":""},{"$f":"IF(W3=\"\",\"\",VLOOKUP(W3,year!A:B,2,FALSE))","v":""}]
[92,"Oliffe, Noella",null,null," 706-679-5347",null,"1556 Wayridge Crossing, Alexandria, Louisiana 71307",null,null,null,null,null,"  noliffe2j@paginegialle.it",null,"Female","Mazda","Millenia","WAUPFAFM8AA479483",30406278354843,"diners-club-carte-blanche",8664.16,null,null,{"$f":"IF(V4=\"\",\"\",VLOOKUP(V4,WMI!A:C,2,FALSE))","v":""},{"$f":"IF(V4=\"\",\"\",VLOOKUP(V4,WMI!A:C,3,FALSE))","v":""},{"$f":"IF(W4=\"\",\"\",VLOOKUP(W4,year!A:B,2,FALSE))","v":""}]
[195,"Betser, Dian",null,null," 520-120-8988",null,"087 Sherman Point, Memphis, Tennessee 38143",null,null,null,null,null,"  dbetser5e@histats.com",null,"Female","Jaguar","XJ Series","WAUHFAFL5AA035845",6.77123287458368E+16,"laser",9783.6200000000008,null,null,{"$f":"IF(V5=\"\",\"\",VLOOKUP(V5,WMI!A:C,2,FALSE))","v":""},{"$f":"IF(V5=\"\",\"\",VLOOKUP(V5,WMI!A:C,3,FALSE))","v":""},{"$f":"IF(W5=\"\",\"\",VLOOKUP(W5,year!A:B,2,FALSE))","v":""}]
[364,"Petley, Kristofer",null,null," 336-152-5308",null,"57448 Mendota Alley, Nashville, Tennessee 37250",null,null,null,null,null,"  kpetleya3@edublogs.org",null,"Male","Isuzu","Ascender","WAUVKAFRXAA614929",3574041192261740,"jcb",9394.68,null,null,{"$f":"IF(V6=\"\",\"\",VLOOKUP(V6,WMI!A:C,2,FALSE))","v":""},{"$f":"IF(V6=\"\",\"\",VLOOKUP(V6,WMI!A:C,3,FALSE))","v":""},{"$f":"IF(W6=\"\",\"\",VLOOKUP(W6,year!A:B,2,FALSE))","v":""}]
[406,"Gannan, Katheryn",null,null," 216-369-9199",null,"1 Carberry Pass, Fresno, California 93773",null,null,null,null,null,"  kgannanb9@cpanel.net",null,"Female","Nissan","Murano","WAUHFBFL6AN682186",374288278189856,"americanexpress",8657.42,null,null,{"$f":"IF(V7=\"\",\"\",VLOOKUP(V7,WMI!A:C,2,FALSE))","v":""},{"$f":"IF(V7=\"\",\"\",VLOOKUP(V7,WMI!A:C,3,FALSE))","v":""},{"$f":"IF(W7=\"\",\"\",VLOOKUP(W7,year!A:B,2,FALSE))","v":""}]
[505,"Cordova, Lilllie",null,null," 716-381-4250",null,"6962 Anhalt Center, Roanoke, Virginia 24029",null,null,null,null,null,"  lcordovae0@google.cn",null,"Female","Land Rover","Freelander","WAUCVAFRXAA609728",4.9118938190940303E+18,"switch",5164.7,null,null,{"$f":"IF(V8=\"\",\"\",VLOOKUP(V8,WMI!A:C,2,FALSE))","v":""},{"$f":"IF(V8=\"\",\"\",VLOOKUP(V8,WMI!A:C,3,FALSE))","v":""},{"$f":"IF(W8=\"\",\"\",VLOOKUP(W8,year!A:B,2,FALSE))","v":""}]
[663,"Powder, Giffer",null,null," 415-658-3718",null,"58 Kensington Trail, Shreveport, Louisiana 71105",null,null,null,null,null,"  gpowderie@cisco.com",null,"Male","Ford","LTD Crown Victoria","WAUUFAFH3AN374574",201551644586330,"diners-club-enroute",6192.57,null,null,{"$f":"IF(V9=\"\",\"\",VLOOKUP(V9,WMI!A:C,2,FALSE))","v":""},{"$f":"IF(V9=\"\",\"\",VLOOKUP(V9,WMI!A:C,3,FALSE))","v":""},{"$f":"IF(W9=\"\",\"\",VLOOKUP(W9,year!A:B,2,FALSE))","v":""}]
[903,"Franek, Nancey",null,null," 616-881-1697",null,"5235 La Follette Parkway, Newton, Massachusetts 02458",null,null,null,null,null,"  nfranekp2@columbia.edu",null,"Female","Subaru","SVX","WAU3VAFR4AA034042",3555512193503080,"jcb",6403.73,null,null,{"$f":"IF(V10=\"\",\"\",VLOOKUP(V10,WMI!A:C,2,FALSE))","v":""},{"$f":"IF(V10=\"\",\"\",VLOOKUP(V10,WMI!A:C,3,FALSE))","v":""},{"$f":"IF(W10=\"\",\"\",VLOOKUP(W10,year!A:B,2,FALSE))","v":""}]
[908,"Heiton, Marty",null,null," 434-257-3416",null,"07137 Straubel Court, Hagerstown, Maryland 21747",null,null,null,null,null,"  mheitonp7@mapy.cz",null,"Female","Jeep","Compass","WAUFFAFL9AA711737",3531569536462040,"jcb",9986.2000000000007,null,null,{"$f":"IF(V11=\"\",\"\",VLOOKUP(V11,WMI!A:C,2,FALSE))","v":""},{"$f":"IF(V11=\"\",\"\",VLOOKUP(V11,WMI!A:C,3,FALSE))","v":""},{"$f":"IF(W11=\"\",\"\",VLOOKUP(W11,year!A:B,2,FALSE))","v":""}]
[25,"Vokins, Roana",null,null," 904-216-3262",null,"16791 Independence Junction, Maple Plain, Minnesota 55572",null,null,null,null,null,"  rvokinso@indiegogo.com",null,"Female","Ford","Bronco","WBAUT9C54AA873036",5.6103862055838496E+16,"china-unionpay",8031.4,null,null,{"$f":"IF(V12=\"\",\"\",VLOOKUP(V12,WMI!A:C,2,FALSE))","v":""},{"$f":"IF(V12=\"\",\"\",VLOOKUP(V12,WMI!A:C,3,FALSE))","v":""},{"$f":"IF(W12=\"\",\"\",VLOOKUP(W12,year!A:B,2,FALSE))","v":""}]
[179,"Wanklyn, Meier",null,null," 267-898-2051",null,"6312 Hoffman Junction, Valley Forge, Pennsylvania 19495",null,null,null,null,null,"  mwanklyn4y@skyrock.com",null,"Male","Lexus","ES","WBAWV1C54AP451852",5610761538613470,"bankcard",9726.41,null,null,{"$f":"IF(V13=\"\",\"\",VLOOKUP(V13,WMI!A:C,2,FALSE))","v":""},{"$f":"IF(V13=\"\",\"\",VLOOKUP(V13,WMI!A:C,3,FALSE))","v":""},{"$f":"IF(W13=\"\",\"\",VLOOKUP(W13,year!A:B,2,FALSE))","v":""}]
[824,"Jeanneau, Bette-ann",null,null," 623-489-0249",null,"12 Florence Park, Kalamazoo, Michigan 49048",null,null,null,null,null,"  bjeanneaumv@parallels.com",null,"Female","Lincoln","Town Car","WBANU5C52AB198579",4917873181982810,"visa-electron",6855.94,null,null,{"$f":"IF(V14=\"\",\"\",VLOOKUP(V14,WMI!A:C,2,FALSE))","v":""},{"$f":"IF(V14=\"\",\"\",VLOOKUP(V14,WMI!A:C,3,FALSE))","v":""},{"$f":"IF(W14=\"\",\"\",VLOOKUP(W14,year!A:B,2,FALSE))","v":""}]
[965,"Arens, Norby",null,null," 713-929-6845",null,"06 Texas Avenue, Tallahassee, Florida 32309",null,null,null,null,null,"  narensqs@cnn.com",null,"Male","Ferrari","430 Scuderia","WBAPK7C57AA826779",374622832349749,"americanexpress",9114.49,null,null,{"$f":"IF(V15=\"\",\"\",VLOOKUP(V15,WMI!A:C,2,FALSE))","v":""},{"$f":"IF(V15=\"\",\"\",VLOOKUP(V15,WMI!A:C,3,FALSE))","v":""},{"$f":"IF(W15=\"\",\"\",VLOOKUP(W15,year!A:B,2,FALSE))","v":""}]
[983,"Noyce, Leonidas",null,null," 314-753-1136",null,"94 Delladonna Parkway, Albany, New York 12222",null,null,null,null,null,"  lnoycera@dedecms.com",null,"Male","Cadillac","CTS-V","WBASP4C5XAC883766",3583802162363100,"jcb",8165.87,null,null,{"$f":"IF(V16=\"\",\"\",VLOOKUP(V16,WMI!A:C,2,FALSE))","v":""},{"$f":"IF(V16=\"\",\"\",VLOOKUP(V16,WMI!A:C,3,FALSE))","v":""},{"$f":"IF(W16=\"\",\"\",VLOOKUP(W16,year!A:B,2,FALSE))","v":""}]
[224,"Mallinson, Hattie",null,null," 303-987-0513",null,"1617 Vidon Crossing, Austin, Texas 78789",null,null,null,null,null,"  hmallinson67@ameblo.jp",null,"Female","Volkswagen","Cabriolet","WBSWL9C57AP589045",374283013744578,"americanexpress",9716.83,null,null,{"$f":"IF(V17=\"\",\"\",VLOOKUP(V17,WMI!A:C,2,FALSE))","v":""},{"$f":"IF(V17=\"\",\"\",VLOOKUP(V17,WMI!A:C,3,FALSE))","v":""},{"$f":"IF(W17=\"\",\"\",VLOOKUP(W17,year!A:B,2,FALSE))","v":""}]
[768,"Kuhnt, Kippy",null,null," 612-736-9625",null,"87 Kipling Junction, Knoxville, Tennessee 37914",null,null,null,null,null,"  kkuhntlb@gravatar.com",null,"Male","GMC","Sierra 3500","WDDEJ7KB8AA014532",6.7596218261742496E+16,"maestro",6818.55,null,null,{"$f":"IF(V18=\"\",\"\",VLOOKUP(V18,WMI!A:C,2,FALSE))","v":""},{"$f":"IF(V18=\"\",\"\",VLOOKUP(V18,WMI!A:C,3,FALSE))","v":""},{"$f":"IF(W18=\"\",\"\",VLOOKUP(W18,year!A:B,2,FALSE))","v":""}]
[882,"Wonter, Augustin",null,null," 206-449-5653",null,"16 Garrison Circle, Saint Cloud, Minnesota 56398",null,null,null,null,null,"  awonteroh@myspace.com",null,"Male","Mitsubishi","Tredia","WDDGF5EB3AR097282",6331109006887140,"switch",7796.01,null,null,{"$f":"IF(V19=\"\",\"\",VLOOKUP(V19,WMI!A:C,2,FALSE))","v":""},{"$f":"IF(V19=\"\",\"\",VLOOKUP(V19,WMI!A:C,3,FALSE))","v":""},{"$f":"IF(W19=\"\",\"\",VLOOKUP(W19,year!A:B,2,FALSE))","v":""}]
[300,"Foulcher, Zenia",null,null," 405-346-3706",null,"1 Canary Parkway, Wichita, Kansas 67260",null,null,null,null,null,"  zfoulcher8b@techcrunch.com",null,"Female","Jeep","Commander","WVWAA7AHXAV306786",5.6022113205174303E+18,"china-unionpay",8350.5,null,null,{"$f":"IF(V20=\"\",\"\",VLOOKUP(V20,WMI!A:C,2,FALSE))","v":""},{"$f":"IF(V20=\"\",\"\",VLOOKUP(V20,WMI!A:C,3,FALSE))","v":""},{"$f":"IF(W20=\"\",\"\",VLOOKUP(W20,year!A:B,2,FALSE))","v":""}]
[776,"Mowsley, Caro",null,null," 619-981-4142",null,"35 Lotheville Alley, Salt Lake City, Utah 84120",null,null,null,null,null,"  cmowsleylj@miitbeian.gov.cn",null,"Female","Oldsmobile","LSS","WVWED7AJ1AW411156",3545657360678170,"jcb",6071.53,null,null,{"$f":"IF(V21=\"\",\"\",VLOOKUP(V21,WMI!A:C,2,FALSE))","v":""},{"$f":"IF(V21=\"\",\"\",VLOOKUP(V21,WMI!A:C,3,FALSE))","v":""},{"$f":"IF(W21=\"\",\"\",VLOOKUP(W21,year!A:B,2,FALSE))","v":""}]
[93,"Floweth, Neddy",null,null," 240-633-3419",null,"19 Dunning Hill, El Paso, Texas 79945",null,null,null,null,null,"  nfloweth2k@tamu.edu",null,"Male","Oldsmobile",88,"WVGAK7A99AD796953",3563299228932080,"jcb",9100,null,null,{"$f":"IF(V22=\"\",\"\",VLOOKUP(V22,WMI!A:C,2,FALSE))","v":""},{"$f":"IF(V22=\"\",\"\",VLOOKUP(V22,WMI!A:C,3,FALSE))","v":""},{"$f":"IF(W22=\"\",\"\",VLOOKUP(W22,year!A:B,2,FALSE))","v":""}]
[130,"Grund, Lissy",null,null," 502-164-8181",null,"38 Bluejay Center, San Diego, California 92170",null,null,null,null,null,"  lgrund3l@illinois.edu",null,"Female","Dodge","Dynasty","WVGAV7AX8AW420402",30463672072265,"diners-club-carte-blanche",6179.9,null,null,{"$f":"IF(V23=\"\",\"\",VLOOKUP(V23,WMI!A:C,2,FALSE))","v":""},{"$f":"IF(V23=\"\",\"\",VLOOKUP(V23,WMI!A:C,3,FALSE))","v":""},{"$f":"IF(W23=\"\",\"\",VLOOKUP(W23,year!A:B,2,FALSE))","v":""}]
[788,"Reddick, Patricio",null,null," 682-815-7801",null,"362 Summer Ridge Drive, Denver, Colorado 80204",null,null,null,null,null,"  preddicklv@joomla.org",null,"Male","Toyota","Tercel","WP1AA2AP1AL263618",4.9056164714866803E+17,"switch",5170.25,null,null,{"$f":"IF(V24=\"\",\"\",VLOOKUP(V24,WMI!A:C,2,FALSE))","v":""},{"$f":"IF(V24=\"\",\"\",VLOOKUP(V24,WMI!A:C,3,FALSE))","v":""},{"$f":"IF(W24=\"\",\"\",VLOOKUP(W24,year!A:B,2,FALSE))","v":""}]
[367,"Attenbrow, Diena",null,null," 646-441-2026",null,"8 Truax Hill, Reading, Pennsylvania 19610",null,null,null,null,null,"  dattenbrowa6@networksolutions.com",null,"Female","Audi","TT","JM1CR2W34A0294522",3547739104193410,"jcb",8269.69,null,null,{"$f":"IF(V25=\"\",\"\",VLOOKUP(V25,WMI!A:C,2,FALSE))","v":""},{"$f":"IF(V25=\"\",\"\",VLOOKUP(V25,WMI!A:C,3,FALSE))","v":""},{"$f":"IF(W25=\"\",\"\",VLOOKUP(W25,year!A:B,2,FALSE))","v":""}]
[65,"Sandy, Ellynn",null,null," 501-420-4368",null,"4 Northport Plaza, Little Rock, Arkansas 72204",null,null,null,null,null,"  esandy1s@techcrunch.com",null,"Female","Toyota","Celica","JHMGE8G20AS864332",3561195233885440,"jcb",7577.68,null,null,{"$f":"IF(V26=\"\",\"\",VLOOKUP(V26,WMI!A:C,2,FALSE))","v":""},{"$f":"IF(V26=\"\",\"\",VLOOKUP(V26,WMI!A:C,3,FALSE))","v":""},{"$f":"IF(W26=\"\",\"\",VLOOKUP(W26,year!A:B,2,FALSE))","v":""}]
[775,"Merrilees, Nevil",null,null," 214-482-6880",null,"220 Walton Trail, Omaha, Nebraska 68105",null,null,null,null,null,"  nmerrileesli@weebly.com",null,"Male","Chevrolet","Tahoe","JHMZE2H58AS650865",4508125969163030,"visa-electron",9310.35,null,null,{"$f":"IF(V27=\"\",\"\",VLOOKUP(V27,WMI!A:C,2,FALSE))","v":""},{"$f":"IF(V27=\"\",\"\",VLOOKUP(V27,WMI!A:C,3,FALSE))","v":""},{"$f":"IF(W27=\"\",\"\",VLOOKUP(W27,year!A:B,2,FALSE))","v":""}]
[241,"Bloy, Anselm",null,null," 412-607-8694",null,"971 Kinsman Trail, Austin, Texas 78754",null,null,null,null,null,"  abloy6o@howstuffworks.com",null,"Male","Chevrolet","Blazer","3VWJX7AJ9AM020436",6334630070215050,"solo",5749.12,null,null,{"$f":"IF(V28=\"\",\"\",VLOOKUP(V28,WMI!A:C,2,FALSE))","v":""},{"$f":"IF(V28=\"\",\"\",VLOOKUP(V28,WMI!A:C,3,FALSE))","v":""},{"$f":"IF(W28=\"\",\"\",VLOOKUP(W28,year!A:B,2,FALSE))","v":""}]
[830,"Fidelus, Dido",null,null," 910-633-1737",null,"1582 Jackson Alley, San Jose, California 95194",null,null,null,null,null,"  dfidelusn1@youtu.be",null,"Female","Lotus","Exige","3VWPG3AG0AM000003",3543480479073530,"jcb",8844.42,null,null,{"$f":"IF(V29=\"\",\"\",VLOOKUP(V29,WMI!A:C,2,FALSE))","v":""},{"$f":"IF(V29=\"\",\"\",VLOOKUP(V29,WMI!A:C,3,FALSE))","v":""},{"$f":"IF(W29=\"\",\"\",VLOOKUP(W29,year!A:B,2,FALSE))","v":""}]
[917,"Mehmet, Nannette",null,null," 806-634-8545",null,"32579 Sachs Avenue, Oklahoma City, Oklahoma 73179",null,null,null,null,null,"  nmehmetpg@blogger.com",null,"Female","BMW","8 Series","3VWJX7AJ7AM921286",6.70998844567082E+16,"laser",5460.16,null,null,{"$f":"IF(V30=\"\",\"\",VLOOKUP(V30,WMI!A:C,2,FALSE))","v":""},{"$f":"IF(V30=\"\",\"\",VLOOKUP(V30,WMI!A:C,3,FALSE))","v":""},{"$f":"IF(W30=\"\",\"\",VLOOKUP(W30,year!A:B,2,FALSE))","v":""}]
[626,"Burkwood, Mufi",null,null," 864-206-6419",null,"853 Drewry Lane, Miami, Florida 33245",null,null,null,null,null,"  mburkwoodhd@twitter.com",null,"Female","Austin","Mini Cooper S","KMHCM3AC8AU629362",3557390090973130,"jcb",5014.1000000000004,null,null,{"$f":"IF(V31=\"\",\"\",VLOOKUP(V31,WMI!A:C,2,FALSE))","v":""},{"$f":"IF(V31=\"\",\"\",VLOOKUP(V31,WMI!A:C,3,FALSE))","v":""},{"$f":"IF(W31=\"\",\"\",VLOOKUP(W31,year!A:B,2,FALSE))","v":""}]
[320,"Spellward, Lezlie",null,null," 713-513-9220",null,"254 Kedzie Drive, Lancaster, Pennsylvania 17622",null,null,null,null,null,"  lspellward8v@uiuc.edu",null,"Female","Lexus","GS","YV1982BWXA1070253",3551209204243060,"jcb",9389.43,null,null,{"$f":"IF(V32=\"\",\"\",VLOOKUP(V32,WMI!A:C,2,FALSE))","v":""},{"$f":"IF(V32=\"\",\"\",VLOOKUP(V32,WMI!A:C,3,FALSE))","v":""},{"$f":"IF(W32=\"\",\"\",VLOOKUP(W32,year!A:B,2,FALSE))","v":""}]
[578,"Tilio, Rand",null,null," 281-854-2183",null,"52399 Garrison Way, Peoria, Illinois 61656",null,null,null,null,null,"  rtiliog1@cpanel.net",null,"Male","Volvo","C70","YV1672MKXA2961055",375288412962829,"americanexpress",5278.65,null,null,{"$f":"IF(V33=\"\",\"\",VLOOKUP(V33,WMI!A:C,2,FALSE))","v":""},{"$f":"IF(V33=\"\",\"\",VLOOKUP(V33,WMI!A:C,3,FALSE))","v":""},{"$f":"IF(W33=\"\",\"\",VLOOKUP(W33,year!A:B,2,FALSE))","v":""}]
[752,"Lewton, Brear",null,null," 619-981-3148",null,"45 Ludington Drive, Columbia, South Carolina 29240",null,null,null,null,null,"  blewtonkv@npr.org",null,"Female","Cadillac","STS","SAJWA0FA3AH374999",5.6102633799228396E+18,"china-unionpay",5364.98,null,null,{"$f":"IF(V34=\"\",\"\",VLOOKUP(V34,WMI!A:C,2,FALSE))","v":""},{"$f":"IF(V34=\"\",\"\",VLOOKUP(V34,WMI!A:C,3,FALSE))","v":""},{"$f":"IF(W34=\"\",\"\",VLOOKUP(W34,year!A:B,2,FALSE))","v":""}]
[124,"Hulbert, Myrtia",null,null," 704-587-5770",null,"0651 Fordem Hill, Young America, Minnesota 55557",null,null,null,null,null,"  mhulbert3f@vkontakte.ru",null,"Female","Ford","F-Series","SALFP2BN3AH363320",201941460618939,"diners-club-enroute",9319.82,null,null,{"$f":"IF(V35=\"\",\"\",VLOOKUP(V35,WMI!A:C,2,FALSE))","v":""},{"$f":"IF(V35=\"\",\"\",VLOOKUP(V35,WMI!A:C,3,FALSE))","v":""},{"$f":"IF(W35=\"\",\"\",VLOOKUP(W35,year!A:B,2,FALSE))","v":""}]
[117,"Cod, Novelia",null,null," 808-861-0795",null,"662 Carpenter Hill, Hartford, Connecticut 06120",null,null,null,null,null,"  ncod38@earthlink.net",null,"Female","Mitsubishi","RVR","1G4HG5EMXAU142238",3562160901082050,"jcb",5279.62,null,null,{"$f":"IF(V36=\"\",\"\",VLOOKUP(V36,WMI!A:C,2,FALSE))","v":""},{"$f":"IF(V36=\"\",\"\",VLOOKUP(V36,WMI!A:C,3,FALSE))","v":""},{"$f":"IF(W36=\"\",\"\",VLOOKUP(W36,year!A:B,2,FALSE))","v":""}]
[223,"Puckrin, Melisent",null,null," 865-740-9388",null,"9 Waubesa Way, Pensacola, Florida 32511",null,null,null,null,null,"  mpuckrin66@about.com",null,"Female","Chevrolet","Malibu","1G4GA5EC2AF695930",5550173826333390,"diners-club-us-ca",8128.62,null,null,{"$f":"IF(V37=\"\",\"\",VLOOKUP(V37,WMI!A:C,2,FALSE))","v":""},{"$f":"IF(V37=\"\",\"\",VLOOKUP(V37,WMI!A:C,3,FALSE))","v":""},{"$f":"IF(W37=\"\",\"\",VLOOKUP(W37,year!A:B,2,FALSE))","v":""}]
[351,"Rubinovitch, Hamlin",null,null," 203-653-6658",null,"4625 Del Sol Point, Lees Summit, Missouri 64082",null,null,null,null,null,"  hrubinovitch9q@facebook.com",null,"Male","Land Rover","LR3","1G4HD5EM9AU629407",3576330930673310,"jcb",5456.98,null,null,{"$f":"IF(V38=\"\",\"\",VLOOKUP(V38,WMI!A:C,2,FALSE))","v":""},{"$f":"IF(V38=\"\",\"\",VLOOKUP(V38,WMI!A:C,3,FALSE))","v":""},{"$f":"IF(W38=\"\",\"\",VLOOKUP(W38,year!A:B,2,FALSE))","v":""}]
[433,"Bowkley, Susanna",null,null," 713-407-7098",null,"69572 Bay Court, Arlington, Virginia 22234",null,null,null,null,null,"  sbowkleyc0@ezinearticles.com",null,"Female","Dodge","Ram 1500 Club","1G4HF5EMXAU841405",5010120014122470,"mastercard",9366.07,null,null,{"$f":"IF(V39=\"\",\"\",VLOOKUP(V39,WMI!A:C,2,FALSE))","v":""},{"$f":"IF(V39=\"\",\"\",VLOOKUP(V39,WMI!A:C,3,FALSE))","v":""},{"$f":"IF(W39=\"\",\"\",VLOOKUP(W39,year!A:B,2,FALSE))","v":""}]
[645,"Littleton, Faber",null,null," 937-700-7363",null,"77373 Moland Plaza, Waco, Texas 76796",null,null,null,null,null,"  flittletonhw@dot.gov",null,"Male","GMC","Sierra 3500","1G4GB5GG9AF221650",3542900561899050,"jcb",5002.49,null,null,{"$f":"IF(V40=\"\",\"\",VLOOKUP(V40,WMI!A:C,2,FALSE))","v":""},{"$f":"IF(V40=\"\",\"\",VLOOKUP(V40,WMI!A:C,3,FALSE))","v":""},{"$f":"IF(W40=\"\",\"\",VLOOKUP(W40,year!A:B,2,FALSE))","v":""}]
{"$rows_left_out":240}
{"sheet":"WMI","index":1,"n_rows":284,"n_cols":3,"rows_kept":284,"cut":false,"hidden":false,"merged":[]}
["WMI","Country","Manufacturer"]
["AAV","South Africa","Volkswagen"]
["AHT","South Africa","Toyota"]
["AFA","South Africa","Ford"]
["BF9","Kenya","KIBO Motorcycles"]
["CL9","Tunisia","Wallyscar"]
["JA","Japan","Isuzu"]
["JC1","Japan","Fiat Automobiles/Mazda"]
["JF","Japan","Fuji Heavy Industries"]
["JHL","Japan","Honda"]
["JHM","Japan","Honda"]
["JM0","Japan","Mazda for Oceania export"]
["JM1","Japan","Mazda"]
["JMB","Japan","Mitsubishi"]
["JM6","Japan","Mazda"]
["JN","Japan","Nissan"]
["JS","Japan","Suzuki"]
["JT","Japan","Toyota"]
["JY","Japan","Yamaha"]
["KL","South Korea","Daewoo/GM Korea"]
["KMH","South Korea","Hyundai"]
["KN","South Korea","Kia"]
["KPT","South Korea","SsangYong"]
["L2C","China","Chery Jaguar Land Rover"]
["L6T","China","Geely"]
["LB3","China","Geely"]
["LA6","China","King Long"]
["LBE","China","Beijing Hyundai"]
["LBV","China","BMW Brilliance"]
["LC0","China","BYD Industry"]
["LDC","China","Dongfeng Peugeot-Citroën"]
["LE4","China","Beijing Benz"]
["LFM","China","FAW Toyota"]
["LFP","China","FAW Car"]
["LFV","China","FAW-Volkswagen"]
["LGB","China","Dongfeng Nissan"]
["LGJ","China","Dongfeng Fengshen"]
["LGW","China","Great Wall (Havel)"]
["LGX","China","BYD Auto"]
["LH1","China","FAW Haima"]
{"$rows_left_out":245}
{"sheet":"year","index":2,"n_rows":30,"n_cols":2,"rows_kept":30,"cut":false,"hidden":false,"merged":[]}
["L",1990]
["M",1991]
["N",1992]
["P",1993]
["R",1994]
["S",1995]
["T",1996]
["V",1997]
["W",1998]
["X",1999]
["Y",2000]
[1,2001]
[2,2002]
[3,2003]
[4,2004]
[5,2005]
[6,2006]
[7,2007]
[8,2008]
[9,2009]
["A",2010]
["B",2011]
["C",2012]
["D",2013]
["E",2014]
["F",2015]
["G",2016]
["H",2017]
["J",2018]
["K",2019]